Remove unused lexical variables in cc-defs.el

* lisp/progmodes/cc-defs.el (c-sc-scan-lists-no-category+1+1)
(c-sc-scan-lists-no-category+1-1, c-sc-scan-lists-no-category-1+1)
(c-sc-scan-lists-no-category-1-1): Remove unused lexical variable
'here' to pacify byte-compilation warnings in cc-engine.el.
6 jobs for master in 13 minutes and 7 seconds (queued for 10 seconds)
Status Job ID Name Coverage
  Fast
failed #18896
test-fast-inotify

00:10:17

 
  Normal
failed #18897
test-lisp-inotify

00:02:49

passed #18898
test-lisp-net-inotify

00:01:54

 
  Slow
skipped #18899
build-native-bootstrap-speed0
skipped #18900
build-native-bootstrap-speed1
skipped #18901
build-native-bootstrap-speed2
 
Name Stage Failure
failed
test-lisp-inotify Normal
make: Leaving directory '/checkout/test'
make[2]: *** [check-doit] Error 1
make[1]: *** [check] Error 2
make: *** [check-lisp] Error 2
Running after script...
$ test -n "$(docker ps -aq -f name=${test_name})" && docker cp ${test_name}:checkout/test ${test_name}
$ test -n "$(docker ps -aq -f name=${test_name})" && docker rm ${test_name}
test-lisp-inotify-3783e7fb
ERROR: Job failed: exit code 2
failed
test-fast-inotify Fast
Makefile:330: recipe for target 'check-doit' failed
make[1]: Leaving directory '/checkout/test'
Makefile:300: recipe for target 'check' failed
make: Leaving directory '/checkout/test'
Running after script...
$ test -n "$(docker ps -aq -f name=${test_name})" && docker cp ${test_name}:checkout/test ${test_name}
$ test -n "$(docker ps -aq -f name=${test_name})" && docker rm ${test_name}
test-fast-inotify-3783e7fb
ERROR: Job failed: exit code 2