; * src/w32fns.c (Fw32_read_registry): Doc fix.

1 job for master in 51 minutes and 36 seconds (queued for 3 seconds)
Status Job ID Name Coverage
  Test
failed #1243
test-all

00:51:36

 
Name Stage Failure
failed
test-all Test
-----------------------
Files examined: 210
Ran 3095 tests, 2977 results as expected, 1 unexpected, 117 skipped
1 files contained unexpected results:
lisp/progmodes/flymake-tests.log
make[2]: *** [check-doit] Error 1
make[1]: *** [check-expensive] Error 2
make: *** [check-expensive] Error 2
ERROR: Job failed: exit code 1