; * src/alloc.c (HAVE_MODULES): remove unused constant

1 job for master in 78 minutes and 46 seconds (queued for 3 seconds)
Status Job ID Name Coverage
  Test
failed #1436
test-all

01:18:46

 
Name Stage Failure
failed
test-all Test
make[2]: *** [check-doit] Error 1
Makefile:313: recipe for target 'check-doit' failed
make[2]: Leaving directory '/builds/emacs/emacs/test'
Makefile:288: recipe for target 'check-expensive' failed
make[1]: *** [check-expensive] Error 2
make[1]: Leaving directory '/builds/emacs/emacs/test'
Makefile:962: recipe for target 'check-expensive' failed
make: *** [check-expensive] Error 2
ERROR: Job failed: exit code 1