Rename shell-command-width to async-shell-command-width (bug#35055)

* lisp/simple.el (async-shell-command-width):
* lisp/net/tramp.el (tramp-handle-shell-command):
* test/lisp/net/tramp-tests.el (tramp-test32-shell-command):
* doc/misc/tramp.texi (Remote processes): Rename this variable.

* doc/emacs/misc.texi (Single Shell): Add async-shell-command-width.
1 job for master in 57 minutes and 2 seconds (queued for 2 seconds)
Status Job ID Name Coverage
  Test
failed #1671
test-all

00:57:02

 
Name Stage Failure
failed
test-all Test
Makefile:318: recipe for target 'check-doit' failed
make[2]: *** [check-doit] Error 1
make[2]: Leaving directory '/builds/emacs/emacs/test'
Makefile:293: recipe for target 'check-expensive' failed
make[1]: *** [check-expensive] Error 2
make[1]: Leaving directory '/builds/emacs/emacs/test'
Makefile:957: recipe for target 'check-expensive' failed
make: *** [check-expensive] Error 2
ERROR: Job failed: exit code 1