; * etc/NEWS: Mention support for HarfBuzz on MS-Windows.

1 job for harfbuzz in 50 minutes and 49 seconds (queued for 2 seconds)
Status Job ID Name Coverage
  Test
failed #1955
test-all

00:50:49

 
Name Stage Failure
failed
test-all Test
Makefile:318: recipe for target 'check-doit' failed
make[2]: Leaving directory '/builds/emacs/emacs/test'
Makefile:293: recipe for target 'check-expensive' failed
make[1]: Leaving directory '/builds/emacs/emacs/test'
Makefile:957: recipe for target 'check-expensive' failed
make[2]: *** [check-doit] Error 1
make[1]: *** [check-expensive] Error 2
make: *** [check-expensive] Error 2
ERROR: Job failed: exit code 1