Mention EMACS_SOCKET_NAME, not XDG_RUNTIME_DIR.

1 job for master in 22 minutes and 46 seconds (queued for 5 seconds)
Status Job ID Name Coverage
  Test
failed #216
test

00:22:46

 
Name Stage Failure
failed
test Test
make[2]: *** [check-doit] Error 1
Makefile:301: recipe for target 'check-doit' failed
make[2]: Leaving directory '/builds/tzz/emacs/test'
Makefile:271: recipe for target 'check' failed
make[1]: *** [check] Error 2
make[1]: Leaving directory '/builds/tzz/emacs/test'
make: *** [check] Error 2
Makefile:955: recipe for target 'check' failed
ERROR: Job failed: exit code 1