; Instrument tramp--test-file-attributes-equal-p

1 job for master in 53 minutes and 35 seconds (queued for 3 seconds)
Status Job ID Name Coverage
  Test
failed #2922
test-all

00:53:35

 
Name Stage Failure
failed
test-all Test
make[2]: *** [check-doit] Error 2
Makefile:318: recipe for target 'check-doit' failed
make[2]: Leaving directory '/builds/emacs/emacs/test'
Makefile:293: recipe for target 'check-expensive' failed
make[1]: *** [check-expensive] Error 2
make[1]: Leaving directory '/builds/emacs/emacs/test'
Makefile:959: recipe for target 'check-expensive' failed
make: *** [check-expensive] Error 2
ERROR: Job failed: exit code 1