Merge remote-tracking branch 'origin/master' into scratch/tsdh-vc-list-files

2 jobs for scratch/tsdh-vc-list-files in 58 minutes and 25 seconds (queued for 1 second)
latest
Status Job ID Name Coverage
  Test
failed #3408
test-all

00:58:25

passed #3409
test-filenotify-gio

00:41:22

 
Name Stage Failure
failed
test-all Test
Makefile:319: recipe for target 'check-doit' failed
make[2]: *** [check-doit] Error 1
make[2]: Leaving directory '/builds/emacs/emacs/test'
Makefile:294: recipe for target 'check-expensive' failed
make[1]: *** [check-expensive] Error 2
make[1]: Leaving directory '/builds/emacs/emacs/test'
Makefile:959: recipe for target 'check-expensive' failed
make: *** [check-expensive] Error 2
ERROR: Job failed: exit code 1