etags: remove some arbitrary limits

etags had undefined behavior if input files, lines, tags, etc.,
had more than INT_MAX bytes.  Clean up the usage of integer types
to fix the overflow errors I found.
* admin/merge-gnulib (GNULIB_MODULES): Add mempcpy.
* lib-src/etags.c: Include inttypes.h, intprops.h.
(memcpyz): New function.  Use it to simplify several occurrences
of memcpy followed by storing a trailing '\0'.
(xnew): Use xnmalloc, to catch overflow on integer multiplication.
(xrnew): Change last arg to multiplier.  The type is not needed.
All callers changed.
(node, lineno, charno, linecharno, invalidcharno, make_tag):
(pfnote, add_node, number_len, C_symtype, lbz, Makefile_targets)
(readline):
Use intmax_t for line numbers and character positions, instead of
int or long.
(linebuffer, make_tag, pfnote, total_size_of_entries, put_entry)
(in_word_set, C_symtype, token, cstack, pushclass_above):
(popclass_above, write_classname, consider_token, C_entries)
(Ruby_functions, Makefile_targets, Lua_functions, TeX_commands)
(TeX_decode_env, erlang_func, erlang_attribute, erlang_atom)
(substitute, regex_tag_multiline, nocase_tail, readline_interval)
(readline, savenstr, concat, etags_getcwd, relative_filename)
(linebuffer_setlen):
Use ptrdiff_t for object sizes, instead of int or long or unsigned
or size_t.
(write_classname, C_entries):
Avoid sprintf, as the result could exceed INT_MAX bytes
and then behavior goes haywire.
(main): Use int, instead of unsigned, for argv counts.
(get_language_from_filename): Use bool for boolean.
(Ruby_functions): Prefer strcpy to memcpy when copying "=".
(linebuffer_setlen): Use ‘if’ instead of ‘while’.
(memory_full, xnmalloc, xnrealloc): New functions.
(xmalloc): Use memory_full, and take a ptrdiff_t instead of a size_t.
(xrealloc): Remove; no longer needed.
* lib/gnulib.mk.in, m4/gnulib-comp.m4: Regenerate.
* lib/mempcpy.c, m4/mempcpy.m4: New files, copied from Gnulib.
1 job for master in 68 minutes and 48 seconds (queued for 3 seconds)
Status Job ID Name Coverage
  Test
failed #4357
test-all

01:08:48

 
Name Stage Failure
failed
test-all Test
make[2]: *** [check-doit] Error 2
Makefile:319: recipe for target 'check-doit' failed
make[2]: Leaving directory '/builds/emacs/emacs/test'
Makefile:294: recipe for target 'check-expensive' failed
make[1]: *** [check-expensive] Error 2
make[1]: Leaving directory '/builds/emacs/emacs/test'
Makefile:959: recipe for target 'check-expensive' failed
make: *** [check-expensive] Error 2
ERROR: Job failed: exit code 1