; * etc/NEWS: Fix a recently added entry.

1 job for master in 57 minutes and 36 seconds (queued for 9 seconds)
Status Job ID Name Coverage
  Test
failed #4457
test-all

00:57:36

 
Name Stage Failure
failed
test-all Test
make[2]: *** [check-doit] Error 1
Makefile:319: recipe for target 'check-doit' failed
make[2]: Leaving directory '/builds/emacs/emacs/test'
Makefile:294: recipe for target 'check-expensive' failed
make[1]: *** [check-expensive] Error 2
make[1]: Leaving directory '/builds/emacs/emacs/test'
make: *** [check-expensive] Error 2
Makefile:959: recipe for target 'check-expensive' failed
ERROR: Job failed: exit code 1