* etc/AUTHORS: Update.

1 job for emacs-26 in 27 minutes and 27 seconds (queued for 2 seconds)
Status Job ID Name Coverage
  Test
failed #500
test

00:27:27

 
Name Stage Failure
failed
test Test
Makefile:285: recipe for target 'check-doit' failed
make[2]: *** [check-doit] Error 1
make[2]: Leaving directory '/builds/emacs/emacs/test'
Makefile:255: recipe for target 'check' failed
make[1]: *** [check] Error 2
make[1]: Leaving directory '/builds/emacs/emacs/test'
Makefile:951: recipe for target 'check' failed
make: *** [check] Error 2
ERROR: Job failed: exit code 1