* lisp/vc/vc-cvs.el (vc-cvs-ignore): Copy-edit doc string

1 job for emacs-27 in 55 minutes and 15 seconds
Status Job ID Name Coverage
  Test
failed #5108
test-all

00:55:15

 
Name Stage Failure
failed
test-all Test
Makefile:319: recipe for target 'check-doit' failed
make[2]: *** [check-doit] Error 2
make[2]: Leaving directory '/builds/emacs/emacs/test'
Makefile:294: recipe for target 'check-expensive' failed
make[1]: *** [check-expensive] Error 2
make[1]: Leaving directory '/builds/emacs/emacs/test'
Makefile:959: recipe for target 'check-expensive' failed
make: *** [check-expensive] Error 2
ERROR: Job failed: exit code 1