; * etc/TODO: Fix last change.

1 job for emacs-27 in 54 minutes and 13 seconds (queued for 3 seconds)
Status Job ID Name Coverage
  Test
failed #5114
test-all

00:54:13

 
Name Stage Failure
failed
test-all Test
Makefile:319: recipe for target 'check-doit' failed
make[2]: Leaving directory '/builds/emacs/emacs/test'
make[2]: *** [check-doit] Error 2
Makefile:294: recipe for target 'check-expensive' failed
make[1]: *** [check-expensive] Error 2
make[1]: Leaving directory '/builds/emacs/emacs/test'
Makefile:959: recipe for target 'check-expensive' failed
make: *** [check-expensive] Error 2
ERROR: Job failed: exit code 1