; * etc/NEWS: Fix typo.

1 job for emacs-27 in 60 minutes and 49 seconds (queued for 1 second)
Status Job ID Name Coverage
  Test
failed #5122
test-all

01:00:49

 
Name Stage Failure
failed
test-all Test
make[2]: *** [check-doit] Error 2
Makefile:319: recipe for target 'check-doit' failed
make[2]: Leaving directory '/builds/emacs/emacs/test'
Makefile:294: recipe for target 'check-expensive' failed
make[1]: *** [check-expensive] Error 2
make[1]: Leaving directory '/builds/emacs/emacs/test'
Makefile:959: recipe for target 'check-expensive' failed
make: *** [check-expensive] Error 2
ERROR: Job failed: exit code 1