Merge from origin/emacs-27

d024fc14 (origin/emacs-27) * doc/lispref/symbols.texi (Definitions)...
d78e0f3c ; lisp/ldefs-boot.el: Update.
27877e7b (tag: emacs-27.1-rc1) * etc/HISTORY: Add Emacs 27.1 releas...
1 job for master in 59 minutes and 23 seconds (queued for 5 seconds)
Status Job ID Name Coverage
  Test
failed #6760
test-all

00:59:23

 
Name Stage Failure
failed
test-all Test
Makefile:318: recipe for target 'check-doit' failed
make[2]: Leaving directory '/builds/emacs/emacs/test'
make[2]: *** [check-doit] Error 1
Makefile:293: recipe for target 'check-expensive' failed
make[1]: Leaving directory '/builds/emacs/emacs/test'
Makefile:959: recipe for target 'check-expensive' failed
make[1]: *** [check-expensive] Error 2
make: *** [check-expensive] Error 2
ERROR: Job failed: exit code 1