* src/alloc.c (mark_maybe_object): Make overflow check conditional.

1 job for master in 66 minutes and 8 seconds (queued for 4 seconds)
Status Job ID Name Coverage
  Test
failed #6791
test-all

01:06:08

 
Name Stage Failure
failed
test-all Test
Makefile:318: recipe for target 'check-doit' failed
make[2]: Leaving directory '/builds/emacs/emacs/test'
make[2]: *** [check-doit] Error 1
Makefile:293: recipe for target 'check-expensive' failed
make[1]: *** [check-expensive] Error 2
make[1]: Leaving directory '/builds/emacs/emacs/test'
make: *** [check-expensive] Error 2
Makefile:959: recipe for target 'check-expensive' failed
ERROR: Job failed: exit code 1