* src/alloc.c (mark_memory): Avoid signed integer overflow

1 job for master in 61 minutes and 58 seconds (queued for 1 second)
Status Job ID Name Coverage
  Test
failed #6801
test-all

01:01:58

 
Name Stage Failure
failed
test-all Test
Makefile:318: recipe for target 'check-doit' failed
make[2]: *** [check-doit] Error 1
make[2]: Leaving directory '/builds/emacs/emacs/test'
Makefile:293: recipe for target 'check-expensive' failed
make[1]: Leaving directory '/builds/emacs/emacs/test'
make[1]: *** [check-expensive] Error 2
Makefile:959: recipe for target 'check-expensive' failed
make: *** [check-expensive] Error 2
ERROR: Job failed: exit code 1