* test/lisp/net/tramp-tests.el

(tramp-test43-asynchronous-requests): Tag it :unstable also for
emba.  Adapt `accept-process-output' arguments.
1 job for master in 28 minutes and 55 seconds (queued for 3 seconds)
Status Job ID Name Coverage
  Test
failed #685
test-all

00:28:55

 
Name Stage Failure
failed
test-all Test
make[2]: *** [check-doit] Error 2
Makefile:309: recipe for target 'check-doit' failed
make[2]: Leaving directory '/builds/emacs/emacs/test'
make[1]: *** [check-expensive] Error 2
Makefile:284: recipe for target 'check-expensive' failed
make[1]: Leaving directory '/builds/emacs/emacs/test'
make: *** [check-expensive] Error 2
Makefile:962: recipe for target 'check-expensive' failed
ERROR: Job failed: exit code 1