Convert manual js indent tests to unit tests

* test/lisp/progmodes/js-tests.el (ert-x): Require.
(js-deftest-indent): New macro.  Use it to define tests for indenting
the below files.

* test/manual/indent/js-chain.js:
* test/manual/indent/js-indent-align-list-continuation-nil.js:
* test/manual/indent/js-indent-init-dynamic.js:
* test/manual/indent/js-indent-init-t.js:
* test/manual/indent/js.js:
* test/manual/indent/jsx-align-gt-with-lt.jsx:
* test/manual/indent/jsx-comment-string.jsx:
* test/manual/indent/jsx-indent-level.jsx:
* test/manual/indent/jsx-quote.jsx:
* test/manual/indent/jsx-self-closing.jsx:
* test/manual/indent/jsx-unclosed-1.jsx:
* test/manual/indent/jsx-unclosed-2.jsx:
* test/manual/indent/jsx.jsx: Move from here...
* test/lisp/progmodes/js-resources/js-chain.js:
* test/lisp/progmodes/js-resources/js-indent-align-list-continuation-nil.js:
* test/lisp/progmodes/js-resources/js-indent-init-dynamic.js:
* test/lisp/progmodes/js-resources/js-indent-init-t.js:
* test/lisp/progmodes/js-resources/js.js:
* test/lisp/progmodes/js-resources/jsx-align-gt-with-lt.jsx:
* test/lisp/progmodes/js-resources/jsx-comment-string.jsx:
* test/lisp/progmodes/js-resources/jsx-indent-level.jsx:
* test/lisp/progmodes/js-resources/jsx-quote.jsx:
* test/lisp/progmodes/js-resources/jsx-self-closing.jsx:
* test/lisp/progmodes/js-resources/jsx-unclosed-1.jsx:
* test/lisp/progmodes/js-resources/jsx-unclosed-2.jsx:
* test/lisp/progmodes/js-resources/jsx.jsx: ...to here.
1 job for master in 69 minutes and 18 seconds (queued for 2 seconds)
Status Job ID Name Coverage
  Test
failed #8328
test-all

01:09:18

 
Name Stage Failure
failed
test-all Test
Makefile:313: recipe for target 'check-doit' failed
make[2]: *** [check-doit] Error 1
make[2]: Leaving directory '/builds/emacs/emacs/test'
Makefile:288: recipe for target 'check-expensive' failed
make[1]: *** [check-expensive] Error 2
make[1]: Leaving directory '/builds/emacs/emacs/test'
Makefile:966: recipe for target 'check-expensive' failed
make: *** [check-expensive] Error 2
ERROR: Job failed: exit code 1