Test interactive-only spec of with-suppressed-warnings

* test/lisp/emacs-lisp/bytecomp-tests.el
(bytecomp-test--with-suppressed-warnings): Test suppressing warning
with interactive-only.
1 job for master in 63 minutes and 16 seconds (queued for 4 seconds)
Status Job ID Name Coverage
  Test
failed #8932
test-all

01:03:16

 
Name Stage Failure
failed
test-all Test
make[2]: *** [check-doit] Error 1
Makefile:313: recipe for target 'check-doit' failed
make[2]: Leaving directory '/builds/emacs/emacs/test'
Makefile:288: recipe for target 'check-expensive' failed
make[1]: *** [check-expensive] Error 2
make[1]: Leaving directory '/builds/emacs/emacs/test'
Makefile:966: recipe for target 'check-expensive' failed
make: *** [check-expensive] Error 2
ERROR: Job failed: exit code 1