* test/lisp/net/tramp-tests.el (tramp-test43-asynchronous-requests):

Make it fit for tramp-adb.  Apply better check in process filter.
1 job for master in 39 minutes and 59 seconds (queued for 3 seconds)
Status Job ID Name Coverage
  Test
failed #1218
test-all

00:39:59

 
Name Stage Failure
failed
test-all Test
Makefile:313: recipe for target 'check-doit' failed
make[2]: *** [check-doit] Error 2
make[2]: Leaving directory '/builds/emacs/emacs/test'
Makefile:288: recipe for target 'check-expensive' failed
make[1]: *** [check-expensive] Error 2
make[1]: Leaving directory '/builds/emacs/emacs/test'
Makefile:962: recipe for target 'check-expensive' failed
make: *** [check-expensive] Error 2
ERROR: Job failed: exit code 1