Don't leave inhibit_buffer_hooks uninitialized

* src/buffer.c (Fget_buffer_create): Explicitly initialize
inhibit_buffer_hooks. (bug#34847)
1 job for master in 52 minutes and 3 seconds (queued for 3 seconds)
Status Job ID Name Coverage
  Test
failed #1244
test-all

00:52:03

 
Name Stage Failure
failed
test-all Test
make[2]: *** [check-doit] Error 1
Makefile:313: recipe for target 'check-doit' failed
make[2]: Leaving directory '/builds/emacs/emacs/test'
Makefile:288: recipe for target 'check-expensive' failed
make[1]: *** [check-expensive] Error 2
make[1]: Leaving directory '/builds/emacs/emacs/test'
Makefile:962: recipe for target 'check-expensive' failed
make: *** [check-expensive] Error 2
ERROR: Job failed: exit code 1