Use three-argument form for out-of-range errors.

This provides more debugging hints for callers.

* src/emacs-module.c (module_copy_string_contents): Use three-argument
form of args-out-of-range.
1 job for master in 61 minutes and 12 seconds (queued for 5 seconds)
Status Job ID Name Coverage
  Test
failed #1503
test-all

01:01:12

 
Name Stage Failure
failed
test-all Test
Makefile:313: recipe for target 'check-doit' failed
make[2]: *** [check-doit] Error 1
make[2]: Leaving directory '/builds/emacs/emacs/test'
Makefile:288: recipe for target 'check-expensive' failed
make[1]: *** [check-expensive] Error 2
make[1]: Leaving directory '/builds/emacs/emacs/test'
Makefile:962: recipe for target 'check-expensive' failed
make: *** [check-expensive] Error 2
ERROR: Job failed: exit code 1