Fix previous object-print/cl-print-object changes

* lisp/cedet/srecode/insert.el
* lisp/cedet/semantic/decorate/include.el
* lisp/cedet/semantic/db-find.el (semanticdb-find-log-activity):
* lisp/cedet/semantic/bovine/c.el
* lisp/cedet/semantic/analyze/debug.el
(semantic-analyzer-debug-insert-include-summary): Fix previous
object-print/cl-print-object changes that were nonsensical.
1 job for master in 26 minutes and 54 seconds (queued for 3 seconds)
Status Job ID Name Coverage
failed #2174


Name Stage Failure
test-all Test
Makefile:319: recipe for target 'compile-main' failed
make[2]: Leaving directory '/builds/emacs/emacs/lisp'
make[2]: *** [compile-main] Error 2
Makefile:411: recipe for target 'lisp' failed
make[1]: Leaving directory '/builds/emacs/emacs'
make[1]: *** [lisp] Error 2
make: *** [bootstrap] Error 2
Makefile:1115: recipe for target 'bootstrap' failed
ERROR: Job failed: exit code 1