Remove debug

* admin/nt/dist-build/build-dep-zips.py:
1 job for feature/smaller-windows in 73 minutes and 2 seconds (queued for 3 seconds)
Status Job ID Name Coverage
  Test
failed #3347
test-all

01:13:02

 
Name Stage Failure
failed
test-all Test
make[2]: *** [check-doit] Error 1
Makefile:318: recipe for target 'check-doit' failed
make[2]: Leaving directory '/builds/emacs/emacs/test'
Makefile:293: recipe for target 'check-expensive' failed
make[1]: *** [check-expensive] Error 2
make[1]: Leaving directory '/builds/emacs/emacs/test'
Makefile:957: recipe for target 'check-expensive' failed
make: *** [check-expensive] Error 2
ERROR: Job failed: exit code 1