* lisp/startup.el (command-line): Fix last change in package--activated

1 job for master in 59 minutes and 29 seconds (queued for 1 second)
Status Job ID Name Coverage
  Test
failed #4191
test-all

00:59:29

 
Name Stage Failure
failed
test-all Test
make[2]: *** [check-doit] Error 1
Makefile:319: recipe for target 'check-doit' failed
make[2]: Leaving directory '/builds/emacs/emacs/test'
Makefile:294: recipe for target 'check-expensive' failed
make[1]: Leaving directory '/builds/emacs/emacs/test'
make[1]: *** [check-expensive] Error 2
Makefile:959: recipe for target 'check-expensive' failed
make: *** [check-expensive] Error 2
ERROR: Job failed: exit code 1