* lisp/tab-bar.el (tab-bar-move-tab-to-frame): New command (bug#38354)

(tab-bar-tabs, tab-bar--tab): Add optional arg FRAME.
(tab-bar-get-buffer-tab): Funcall tab-bar-tabs-function with arg FRAME
instead of using with-selected-frame.
1 job for master in 64 minutes and 45 seconds (queued for 3 seconds)
Status Job ID Name Coverage
failed #4418


Name Stage Failure
test-all Test
Makefile:319: recipe for target 'check-doit' failed
make[2]: *** [check-doit] Error 1
make[2]: Leaving directory '/builds/emacs/emacs/test'
Makefile:294: recipe for target 'check-expensive' failed
make[1]: *** [check-expensive] Error 2
make[1]: Leaving directory '/builds/emacs/emacs/test'
Makefile:959: recipe for target 'check-expensive' failed
make: *** [check-expensive] Error 2
ERROR: Job failed: exit code 1